{"text_format":"1","workbook":"xlsx","n_sheets":4,"sheets":["Information","Expense Report Detail","Employee Table","CC Table"],"not_rendered":{"charts":0,"images":0,"macros":1,"external_links":0,"defined_names":7,"comments":0,"pivot_tables":0},"unopened":[],"bounds":{"document_bytes":16777216,"sheet_cells":100000,"rows_first":2000,"rows_last":500,"rows_between":2000,"halvings":0,"cell_chars":16384,"cell_head_chars":4096},"cells_cut":0,"cells_raw":0,"read":"whole","date_system":"1900"}

{"sheet":"Information","index":0,"n_rows":62,"n_cols":2,"rows_kept":62,"cut":false,"hidden":false,"merged":[]}
["The National Rifle Association of America"]
["Expense Report"]
[]
["General Reminders"]
[]
["1)","For a complete list and explanation of Travel Guidelines please see The Travel"]
[null,"and Business Reimbursement Guidelines effective 10/05/21 (Employee Handbook)."]
[]
["2)","It is your responsibility to know and apply the Travel & Business Guidelines"]
[null,"before you spend Association assets."]
[]
["3)","Financial Services will do its best to process and reimburse employees within 7 to 10"]
[null,"business days following submission of the Expense Report to Financial Services."]
[]
["4)","Should you need assistance please contact Evan Knight at ext. 1659."]
[]
["Using the Expense Report online using Microsoft Excel"]
[]
["1)","This Expense report is split onto two Tabs, which are located at the bottom"]
[null,"of the screen.  You can move between Tabs by clicking your mouse pointer on"]
[null,"Information or Expense Report Detail."]
[]
["Expense Report Detail Directions"]
[]
["1)","Employees, please enter your Employee I.D. Number.  Your Employee I.D."]
[null,"Number is located on your security badge.  Your Name, Division"]
[null,"and Cost Center should appear automatically.  Non-employees please enter"]
[null,"your address in the space provided."]
[]
["2)","Please enter any cash advance received from the NRA. Please enter your"]
[null,"Travel Authorization Form # in cell O8."]
[]
["3)","In the Expense Detail Section enter only \"out of pocket\" expenses."]
[null,"Note: Expenses charged directly to the NRA via American Express, Hertz,"]
[null,"etc. or through MacNair Travel Agency should only be entered in the Direct Charge"]
[null,"Detail section of the Expense Report (See # 7 below)."]
[]
["4)","The Expense Detail Section should include expenses for yourself only.  However,"]
[null,"in certain circumstances (meals), it is not practical to obtain individual receipts."]
[null,"A designated employee may pay for the entire group.  All employees names must"]
[null,"be included on the receipt."]
[]
["5)","If you enter expenses in the Other column (9), please describe the expenses"]
[null," in the space provided (Cell D24) on the Expense Report."]
[]
["6)","The Entertainment / Business Meals Detail should include meals and "]
[null,"entertainment with outside representatives.  Please see the Guidelines"]
[null,"mentioned above for IRS information requirements.  By filling out this section"]
[null,"completely the NRA meets the IRS requirements."]
[]
["7)","To better track and budget for the Total cost of travel please enter the Vendor,"]
[null,"Description and $ amount of any charges billed directly to the NRA.  These vendors"]
[null,"include: MacNair, Hertz, American Express etc."]
[]
["8)","The Financial Services Division has created a Standard Account Distribution for "]
[null,"your expenses.  You may prefer a different Account, Cost Center or Program #."]
[null,"You can use the Standard Distribution by clicking on the Accept button or you"]
[null,"can enter your accounts directly in the Final Account Distribution Section."]
[]
["9)","Please print, sign and date your expense report."]
[null,"Attach your receipts and get your expense report approved."]
[null,"Submit your expense report to the Financial Services Division for payment."]

{"sheet":"Expense Report Detail","index":1,"n_rows":55,"n_cols":16,"rows_kept":55,"cut":false,"hidden":false,"merged":[]}
["The National Rifle Association of America"]
["2024 Expense Report"]
[]
["Employee I.D.:"," ",null,"Name (If not an employee):",null,null,null,null,null,null,"Total Employee Paid Expenses:",null,null,null,{"$f":"O23+O33","v":0}]
["Name:",{"$f":"IF(ISERROR(VLOOKUP(B4,Employees,2,FALSE)),\"\",VLOOKUP(B4,Employees,2,FALSE))","v":""},null,"Address (If not an employee):",null,null,null,null,null,null,"Less Cash Advance:",null,null,null,0]
["Division:",{"$f":"IF(ISERROR(VLOOKUP(B4,Employees,4,FALSE)),\"\",VLOOKUP(B4,Employees,4,FALSE))","v":""},null,"City, State & Zip:",null,null,null,null,null,null,"Amount Due to NRA from Employee:    ",null,null,null,{"$f":"IF(O4-O5<0,O5-O4,0)","v":0}]
["Cost Center #:",{"$f":"IF(ISERROR(VLOOKUP(B4,Employees,3,FALSE)),\"\",VLOOKUP(B4,Employees,3,FALSE))","v":""},null,null,null,null,null,null,null,null,"Amount Due to Employee from NRA:",null,null,null,{"$f":"IF(O4-O5>0,O4-O5,0)","v":0}]
["Purpose:",null,null,"Travel City:",null,null,null,"Travel State:",null,null,"(per Travel Authorization Form)",null,null,"TA Form #:"]
["EXPENSE DETAIL"]
[null,null,null,"(1)","(2)","(3)",null,"(4)","(5)",null,"(6)","(7)","(8)","(9)"]
["Date",null,null,"Plane /","Auto",null,"Personal Auto",null,"Tolls/","Total",null,"Meals"]
["MM/DD-MM/DD","Description",null,"Train","Rental","Taxi","Miles",0.67,"Other","Transport","Lodging","(Self)","Telephone","Other","TOTAL  "]
[null,null,null,null,null,null,null,{"$f":"ROUND(G13*H$12,2)","v":0},null,{"$f":"SUM(D13:F13)+SUM(H13:I13)","v":0},null,null,null,null,{"$f":"SUM(J13:N13)","v":0}]
[null,null,null,null,null,null,null,0,null,0,null,null,null,null,{"$f":"SUM(J14:N14)","v":0}]
[null,null,null,null,null,null,null,0,null,0,null,null,null,null,0]
[null,null,null,null,null,null,null,0,null,0,null,null,null,null,0]
[null,null,null,null,null,null,null,0,null,0,null,null,null,null,0]
[null,null,null,null,null,null,null,0,null,0,null,null,null,null,0]
[null,null,null,null,null,null,null,0,null,{"$f":"SUM(D19:F19)+SUM(H19:I19)","v":0},null,null,null,null,0]
[null,null,null,null,null,null,null,0,null,{"$f":"SUM(D20:F20)+SUM(H20:I20)","v":0},null,null,null,null,0]
[null,null,null,null,null,null,null,0,null,{"$f":"SUM(D21:F21)+SUM(H21:I21)","v":0},null,null,null,null,0]
[null,null,null,null,null,null,null,0,null,{"$f":"SUM(D22:F22)+SUM(H22:I22)","v":0},null,null,null,null,0]
[null,null,"TOTAL  ",{"$f":"SUM(D13:D22)","v":0},{"$f":"SUM(E13:E22)","v":0},{"$f":"SUM(F13:F22)","v":0},null,{"$f":"SUM(H13:H22)","v":0},0,0,0,0,0,0,0]
["Description of Other Charges (Column 9):"]
[]
["Entertainment/Business Meals Detail (a receipt is required for each item of entertainment)"]
["Date","Name of place",null,null,"  Name(s) of Guest(s)",null,null,null,null,"Benefit to NRA",null,null,null,null,"Amount"]
[]
[]
[]
[]
[]
[null,null,null,null,null,null,null,null,null,null,null,null,null,"   Total",{"$f":"SUM(O28:O32)","v":0}]
[]
["DIRECT CHARGE DETAIL",null,null,null,null,null,"Standard Account Distribution",null,null,null,null,"Final Account Distribution"]
[null,null,null,null,null,null,null,"Cost",null,null,null,"Account","Cost","Program"]
["Expenses Charged directly to the NRA:",null,null,null,null,null,"Account","Center","Description","Amount",null,"Number","Center","Number","Amount"]
[null,null,null,null,null,null,5200,{"$f":"$B$7","v":""},"Travel",{"$f":"O23","v":0},null,null,null,null,0]
["Vendor / CC:","Description:",null,"Expense:",null,null,5220,{"$f":"$B$7","v":""},"Bus. Entert.",{"$f":"O33","v":0},null,null,null,null,0]
[null,null,null,null,null,null,null,null,null,null,null,null,null,null,0]
[null,null,null,null,null,null,"You may use the Standard Account Distribution OR",null,null,null,null,null,null,null,0]
[null,null,null,null,null,null,"you may enter alternative accounts in the Final",null,null,null,null,null,null,null,0]
[null,null,null,null,null,null,"Account Distribution area to the right.",null,null,null,null,null,null,null,0]
[null,null,null,null,null,null,"To accept the Standard Distribution, just click on the ",null,null,null,null,null,null,null,0]
[null,null,null,null,null,null,"green Accept Button below.",null,null,null,null,null,null,{"$f":"IF(O45>0,\"Employee Paid Expenses\",\"\")","v":""},{"$f":"SUM(O38:O44)","v":0}]
[null,null,null,null,null,null,"     (Note: If you click the Button and nothing happens"]
[null,null,null,null,null,null,"              your Excel Macros are not enabled. Call x1659)",null,null,null,null,{"$f":"IF(O4>O5,2000,\"\")","v":""},{"$f":"IF(O4>O5,0,\"\")","v":""},{"$f":"IF(O4>O5,\"Act Payable\",\"\")","v":""},{"$f":"IF(O4>O5,-O4+O5,\"\")","v":""},"FSD Only"]
["Total Direct Charges  ",null,null,{"$f":"SUM(D40:D47)","v":0},null,null,null,null,"Total",{"$f":"SUM(J38:J39)","v":0},null,{"$f":"IF(O5=0,\"\",1300)","v":""},{"$f":"IF(O5=0,\"\",0)","v":""},{"$f":"IF(O5=0,\"\",\"Advance\")","v":""},{"$f":"IF(O5=0,\"\",IF(O5=O4,-O4,IF(O5<O4,-O5,-O4)))","v":""},"FSD Only"]
["Total Employee Paid Expenses:",null,null,{"$f":"J48","v":0},null,null,null,null,null,null,null,{"$f":"IF(O5>O4,\"Please code your check to 1300-00000\",\"\")","v":""},null,null,{"$f":"IF(O5>O4,O5-O4,\"\")","v":""}]
[null,null,null,null,null,"Signature of Employee",null,null,null,"Date","Approved By",null,null,null,"Date"]
["Grand Total for all Charges and Expenses",null,null,{"$f":"D49+D48","v":0}]
[null,null,null,null,null,"I certify that all expenses are in accordance with NRA policy and established guidelines and are appropriately documented."]
[null,null,null,null,null,{"$f":"IF(ROUND(J48,5)=ROUND(O45,5),\"\",\"STOP! Total Employee Paid Expenses (incl. Advances) does not equal the Final Account Distribution.\")","v":""}]
[null,null,null,null,null,"Financial Services will do its best to process and reimburse employees within 7 to 10"]
[null,null,null,null,null,"business days following submission of the Expense Report to Financial Services."]

{"sheet":"Employee Table","index":2,"n_rows":782,"n_cols":7,"rows_kept":782,"cut":false,"hidden":true,"merged":[]}
["ID #","Name","Cost Center","Division",null,null,"Updated: 09/07/23"]
[1," ",10100,{"$f":"VLOOKUP(LEFT(C2,5)*1,Division,4,FALSE)","v":"Office Of The President"}]
[363,"Lapierre, Wayne R.",10200,"Executive Vice President"]
[448,"Murphy, Phyllis L.",43110,"Competitive Shooting"]
[620,"Brock-Smith, Cheryl V.",30530,"Administrative Svcs"]
[987,"Godstrey, Brenda",30305,"Information Services"]
[1071,"Kramer, Michele A.",43110,"Competitive Shooting"]
[1139,"Sabatier, Michael L.",10300,"Office Of The Treasurer"]
[1167,"Whitley, Cynthia M.",30500,"Administrative Svcs"]
[1218,"Ballew, Michael",0,"Office of the Treasurer"]
[1261,"Fischer, Andra V.",10200,"Executive Vice President"]
[1304,"Frazer, James B.",30301,"Information Services"]
[1404,"Sookia, Sandra P.",30530,"Administrative Svcs"]
[1440,"Tahmassebi, Stefan B.",10210,"General Counsel"]
[1495,"Schreier, E P.",40685,"NFM & Gun Collecting"]
[1497,"Landfried, Terrence I.",10700,"Inst For Legislative Action"]
[1523,"Brooks, Gloria V.",40830,"Education & Training"]
[1621,"Keefe, Mark A.",20100,"Publications"]
[1683,"Worley, Edward E.",61100,"Advancement"]
[1771,"Trible, William E.",40685,"NFM & Gun Collecting"]
[1809,"Littles, Rickey",80624,"Membership"]
[1811,"Poole, Jeffrey L.",40200,"NRA Shows & Exhibits"]
[1940,"Frazer, John C.",10400,"Office Of The Secretary"]
[1949,"Contreras, Guillermo A.",30530,"Administrative Svcs"]
[1960,"Patterson, Jenny L.",80624,"Membership"]
[1971,"Mica, Tara R.",10700,"Inst For Legislative Action"]
[2053,"Kessler, Evelyn Q.",20100,"Publications"]
[2096,"Kozuch, Randy J.",10700,"Inst For Legislative Action"]
[2107,"George, Lisa M.",10310,"Purchasing"]
[2156,"Robinson, Derek S.",80600,"Membership"]
[2180,"Roulette, Anthony F.",10700,"Inst For Legislative Action"]
[2258,"Hilton, John H.",61631,"Advancement"]
[2275,"Sanford, Michael J.",20100,"Publications"]
[2287,"Purtell, James F.",30300,"Information Services"]
[2295,"Amaya, Rudis S.",40125,"General Operations"]
[2308,"Brown, Samantha L.",20400,"Publications"]
[2331,"Soto, Shawne E.",30200,"Human Resources"]
[2339,"Manthos, Melinda L.",80600,"Membership"]
[2346,"Quandahl, Larry J.",20100,"Publications"]
[2365,"Mehall, Karen",20900,"Publications"]
[2398,"Daniels, Stephanie S.",10400,"Office Of The Secretary"]
[2439,"Hallow, Mildred",10200,"Executive Vice President"]
[2447,"Bailey, John",40200,"NRA Shows & Exhibits"]
[2457,"Blaz, Michael G.",10210,"General Counsel"]
[2464,"Farmer, Naomi A.",10700,"Inst For Legislative Action"]
[2477,"Benedict, Daniel",30306,"Information Services"]
[2514,"Wade, Matthew",10300,"Office Of The Treasurer"]
[2551,"Lavery, Donald G.",30510,"Administrative Svcs"]
[2552,"Martinez, Cynthia A.",0,"Office of the Treasurer"]
[2553,"Polen, Jack E.",0,"Office of the Treasurer"]
[2554,"Galanick, Joseph",30305,"Information Services"]
[2572,"Labrozzi, David",20120,"Publications"]
[2621,"McElrath, Daniel T.",20830,"Publications"]
[2629,"Majors, Christina M.",10300,"Office Of The Treasurer"]
[2634,"Weaver, Mark S.",20120,"Publications"]
[2651,"Harris, Karen G.",20500,"Publications"]
[2674,"Boyd, Robert",20830,"Publications"]
[2683,"Dent, Gary E.",30305,"Information Services"]
[2691,"Hinchliffe, David W.",80624,"Membership"]
[2705,"Sheetz, Brian C.",20200,"Publications"]
[2713,"Galythly, Skipp C.",10210,"General Counsel"]
[2715,"Tedrick, Thomas R.",10300,"Office Of The Treasurer"]
[2720,"Olmsted, J S.",20300,"Publications"]
[2722,"Supernaugh, Lisa L.",40100,"General Operations"]
[2727,"Wright, Kevin A.",30900,"Administrative Svcs"]
[2742,"Ives, Thomas K.",30900,"Administrative Svcs"]
[2783,"Ulik, Thomas A.",60280,"Field Operations"]
[2838,"Hoyer, Glen A.",40900,"Law Enforcement"]
[2851,"Fricke, Mark A.",40930,{"$f":"VLOOKUP(LEFT(C69,5)*1,Division,4,FALSE)","v":"Law Enforcement"}]
[2863,"St Onge, Angela L.",50100,"Financial Services"]
[2865,"Miller, David A.",40930,"Law Enforcement"]
[2870,"Rowling, Sonya B.",10300,"Office Of The Treasurer"]
[2880,"Briemann, Jennifer L.",10700,{"$f":"VLOOKUP(LEFT(C73,5)*1,Division,4,FALSE)","v":"Inst For Legislative Action"}]
[2914,"Coder, Milissa E.",61200,"Advancement"]
[2924,"Fleming, Matthew S.",40730,"Rec Programs & Ranges"]
[2929,"Shine, Maryellen W.",40930,"Law Enforcement"]
[2945,"Campbell, William S.",40930,"Law Enforcement"]
[2957,"Conte, Christopher A.",10210,"General Counsel"]
[2963,"Murphy, Lathan D.",61600,"Advancement"]
[2964,"Jenkins, Robert W.",30302,"Information Services"]
[2972,"Wolfe, Terri A.",20100,"Publications"]
[2976,"OConnell, Deborah L.",20409,"Publications"]
[2981,"Arulanandam, Andrew A.",10220,"Executive Vice President"]
[2993,"Claman, John T.",20120,"Publications"]
[3006,"Galvan, Jacqueline K.",10700,"Inst For Legislative Action"]
[3013,"Sisson, Anne E.",10300,"Office Of The Treasurer"]
[3029,"Howard, John K.",40800,"Education & Training"]
[3060,"Enck, Kory R.",60204,"Field Operations"]
[3066,"Dove, James V.",30302,"Information Services"]
[3067,"Smith, Ann Y.",20600,"Publications"]
[3072,"Eckberg, Erik D.",10700,"Inst For Legislative Action"]
[3095,"Bower, Matthew H.",10210,"General Counsel"]
[3100,"Kuntz, Michelle E.",20400,"Publications"]
[3111,"Simon, Brett P.",40830,"Education & Training"]
[3118,"Erstling, Michael J.",50100,"Financial Services"]
[3154,"Zimmer, Donald R.",30305,"Information Services"]
[3161,"Lipp, Marcus M.",40920,"Law Enforcement"]
[3165,"Crismore, Joseph R.",60228,"Field Operations"]
[3169,"Merrill, Robert D.",61632,"Advancement"]
[3258,"Wilson, Wayne G.",40210,"NRA Shows & Exhibits"]
[3280,"Weber, David J.",40930,"Law Enforcement"]
[3287,"Rickwalder, Thomas C.",20500,"Publications"]
[3303,"Kirchgessner, David L.",30900,"Administrative Svcs"]
[3306,"Capitano, Ann M.",10310,"Purchasing"]
[3413,"Cole, Tim J.",40930,"Law Enforcement"]
[3417,"Handlon, James C.",20400,"Publications"]
[3437,"Johnson, Constance S.",10300,"Office Of The Treasurer"]
[3441,"Phelps, Stephanie M.",0,"Office of the Treasurer"]
[3449,"Gervase, Sarah A.",10210,"General Counsel"]
[3462,"Miniter, Frank C.",20700,"Publications"]
[3502,"Valdez, Adrian L.",0,"Office of the Treasurer"]
[3526,"Beehner, John A.",40930,"Law Enforcement"]
[3533,"Mulford, James R.",30306,"Information Services"]
[3534,"Kennedy, Michael O.",30306,"Information Services"]
[3535,"Sanders, Douglas W.",30306,"Information Services"]
[3536,"Daniel, Donald",30306,"Information Services"]
[3554,"Webb, Danny H.",30900,"Administrative Svcs"]
[3555,"Martin, Timothy A.",80624,"Membership"]
[3561,"Hopkins, Derrick L.",40930,"Law Enforcement"]
[3562,"Crouch, Linda S.",30200,"Human Resources"]
{"$rows_left_out":663}
{"sheet":"CC Table","index":3,"n_rows":210,"n_cols":4,"rows_kept":210,"cut":false,"hidden":true,"merged":[]}
["Cost Center","Cost Center Name","Division","Department"]
[0,"Whittington Center","Executive Offices","Office of the Treasurer"]
[100,"General Revenue","General Revenue","General Revenue"]
[10100,"Office of the President","Executive Offices","Office Of The President"]
[10200,"Executive Vice President","Executive Offices","Executive Vice President"]
[10205,"Security","Executive Offices","Executive Vice President"]
[10210,"Office of General Counsel","Executive Offices","General Counsel"]
[10220,"Public Affairs","Executive Offices","Executive Vice President"]
[10250,"Compliance","Executive Offices","Compliance"]
[10300,"Office of the Treasurer","Executive Offices","Office Of The Treasurer"]
[10310,"Purchasing","Executive Offices","Purchasing"]
[10400,"Administration","Executive Offices","Office Of The Secretary"]
[10410,"Director Elections","Executive Offices","Office Of The Secretary"]
[10600,"Annual Mtg-Board/Mbr Related","Executive Offices","Office Of The Secretary"]
[10601,"Fall Board","Executive Offices","Office Of The Secretary"]
[10605,"Winter Board","Executive Offices","Office Of The Secretary"]
[10650,"Standing & Special Committees","Executive Offices","Office Of The Secretary"]
[10690,"Other Committee Expenses","Executive Offices","Office Of The Secretary"]
[10700,"Institute for Legislative Action","Institute for Legislative Action","Inst For Legislative Action"]
[20100,"Administration","Publications","Publications"]
[20120,"Art Department","Publications","Publications"]
[20140,"Photography Department","Publications","Publications"]
[20200,"The American Rifleman","Publications","Publications"]
[20300,"The American Hunter","Publications","Publications"]
[20400,"Advertising/Production Operations","Publications","Publications"]
[20401,"Integrated Marketing","Publications","Publications"]
[20402,"Eastern Sales","Publications","Publications"]
[20403,"Northeast Sales","Publications","Publications"]
[20404,"Southeast Sales","Publications","Publications"]
[20405,"Eastern Direct Sales","Publications","Publications"]
[20406,"Western Region","Publications","Publications"]
[20407,"Southwest Sales","Publications","Publications"]
[20408,"Western Sales","Publications","Publications"]
[20409,"Western Direct Sales","Publications","Publications"]
[20410,"Sales Administration","Publications","Publications"]
[20500,"Digital Operations","Publications","Publications"]
[20600,"Women's Digital","Publications","Publications"]
[20700,"America's 1st Freedom","Publications","Publications"]
[20810,"NRA Family","Publications","Publications"]
[20820,"Shooting Sports USA","Publications","Publications"]
[20830,"Shooting Illustrated","Publications","Publications"]
[20900,"Hunters' Leadership Forum","Publications","Publications"]
[30200,"Human Resources","Human Resources","Human Resources"]
[30300,"IS Administration","Information Services","Information Services"]
[30301,"Security","Information Services","Information Services"]
[30302,"Computer Operations","Information Services","Information Services"]
[30305,"Software Development","Information Services","Information Services"]
[30306,"Marketing Database Management","Information Services","Information Services"]
[30307,"Emergency Management Plan","Information Services","Information Services"]
[30500,"Administration","General Operations","Administrative Svcs"]
[30510,"Fairfax Facilities","General Operations","Administrative Svcs"]
[30515,"Waples Row Facilities","General Operations","Administrative Svcs"]
[30530,"Mail Room","General Operations","Administrative Svcs"]
[30600,"Food Services","General Operations","Administrative Svcs"]
[30900,"NRA Range","General Operations","Administrative Svcs"]
[40000,"Foundation Grants","General Operations","General Operations"]
[40100,"GO Administration","General Operations","General Operations"]
[40125,"School Shield","General Operations","General Operations"]
[40130,"Community Outreach","General Operations","Rec Programs & Ranges"]
[40200,"NRA Shows - Admin","General Operations","NRA Shows & Exhibits"]
[40210,"Annual Meeting","General Operations","NRA Shows & Exhibits"]
[40220,"Great American Outdoor Show","General Operations","NRA Shows & Exhibits"]
[40225,"Exhibit Operations","General Operations","NRA Shows & Exhibits"]
[40230,"Catalog & Store Operations","General Operations","NRA Shows & Exhibits"]
[40500,"Sales - Program Materials","General Operations","Administrative Svcs"]
[40685,"National Firearms Museum","General Operations","NFM & Gun Collecting"]
[40700,"Community Engagement Administration","General Operations","Rec Programs & Ranges"]
[40710,"Range Services","General Operations","Rec Programs & Ranges"]
[40720,"Clubs & Associations","General Operations","Rec Programs & Ranges"]
[40730,"Hunter Services","General Operations","Rec Programs & Ranges"]
[40800,"E&T Administration","General Operations","Education & Training"]
[40810,"Youth Programs","General Operations","Education & Training"]
[40830,"Training Department","General Operations","Education & Training"]
[40900,"LEAD Administration","General Operations","Law Enforcement"]
[40902,"Conventions & Conferences","General Operations","Law Enforcement"]
[40903,"Public Relations","General Operations","Law Enforcement"]
[40905,"National Police Shooting Championships","General Operations","Law Enforcement"]
[40912,"Instructor Certifications","General Operations","Law Enforcement"]
[40920,"Police Competitions - Admin","General Operations","Law Enforcement"]
[40921,"Police - Other Tournaments","General Operations","Law Enforcement"]
[40922,"Tactical Police Competitions","General Operations","Law Enforcement"]
[40923,"Police Award Program","General Operations","Law Enforcement"]
[40930,"Law Enforcement Trng Admin","General Operations","Law Enforcement"]
[43100,"Comp Shooting Administration","General Operations","Competitive Shooting"]
[43110,"Tournament Resources - Admin","General Operations","Competitive Shooting"]
[43160,"(c)4 - Tournament Admin","General Operations","Competitive Shooting"]
[43300,"Silhouette  Admin","General Operations","Competitive Shooting"]
[43400,"Rifle Programs - Administration","General Operations","Competitive Shooting"]
[43500,"HPR - Admin","General Operations","Competitive Shooting"]
[43600,"College & School Prog - Admin","General Operations","Competitive Shooting"]
[43700,"Pistol & Support - Administration","General Operations","Competitive Shooting"]
[50100,"Admin & Account Operations","Financial Services","Financial Services"]
[50120,"Benefits & Payroll Taxes","Fixed Costs","Fixed Costs"]
[50130,"Fixed Costs","Fixed Costs","Fixed Costs"]
[50140,"Allocated Depreciation","Fixed Costs","Fixed Costs"]
[51100,"Tax Compliance","Tax Compliance","Tax Compliance"]
[60100,"FO Administration","Advancement","Field Operations"]
[60201,"Field Representative # 1","Advancement","Field Operations"]
[60202,"Field Representative # 2","Advancement","Field Operations"]
[60203,"Field Representative # 3","Advancement","Field Operations"]
[60204,"Field Representative # 4","Advancement","Field Operations"]
[60205,"Field Representative # 5","Advancement","Field Operations"]
[60206,"Field Representative # 6","Advancement","Field Operations"]
[60207,"Field Representative # 7","Advancement","Field Operations"]
[60208,"Field Representative # 8","Advancement","Field Operations"]
[60209,"Field Representative # 9","Advancement","Field Operations"]
[60210,"Field Representative # 10","Advancement","Field Operations"]
[60211,"Field Representative # 11","Advancement","Field Operations"]
[60212,"Field Representative # 12","Advancement","Field Operations"]
[60213,"Field Representative # 13","Advancement","Field Operations"]
[60214,"Field Representative # 14","Advancement","Field Operations"]
[60215,"Field Representative # 15","Advancement","Field Operations"]
[60216,"Field Representative # 16","Advancement","Field Operations"]
[60217,"Field Representative # 17","Advancement","Field Operations"]
[60218,"Field Representative # 18","Advancement","Field Operations"]
[60219,"Field Representative # 19","Advancement","Field Operations"]
[60220,"Field Representative # 20","Advancement","Field Operations"]
[60221,"Field Representative # 21","Advancement","Field Operations"]
[60222,"Field Representative # 22","Advancement","Field Operations"]
[60223,"Field Representative # 23","Advancement","Field Operations"]
{"$rows_left_out":90}